Target
Mitogen-activated protein kinase 1 [8-360]
Ligand
BDBM193407
Substrate
Meas. Tech.
ERK-2 Enzymatic Assay
pH
7.3±n/a
IC50
25±n/a nM
Comments
extracted
Citation
 Blake, JFCook, AGaudino, JGunawardana, IWHicken, EJHunt, KWLyon, MMetcalf, ATMohr, PJMoreno, DANewhouse, BRen, LSchwarz, JChen, HGazzard, LSchmidt, JDo, S Serine/threonine kinase inhibitors US Patent  US9670208 Publication Date 6/6/2017 
Target
Name:
Mitogen-activated protein kinase 1 [8-360]
Synonyms:
ERK2 MAPK1 Mitogen Activated Kinase 1 Mitogen-activated protein kinase 1 (aa 8-360) PRKM2
Type:
Mol. Mass.:
40835.09
Organism:
Homo sapiens (Human)
Description:
P28482 aa 8-360
Residue:
353
  
Inhibitor
Name:
BDBM193407
Synonyms:
US9670208, Example 195 (S)-4-(3-(methoxy(phenyl)methyl)-[1,2,4]triazolo[4,3-a]pyridin-7-yl)-N-(tetrahydro-2H-pyran-4-yl)pyrimidin-2-amine
Type:
Small organic molecule
Emp. Form.:
C23H24N6O2
Mol. Mass.:
416.4757
SMILES:
CO[C@H](c1nnc2cc(ccn12)-c1ccnc(NC2CCOCC2)n1)c1ccccc1
: