Target
Mitogen-activated protein kinase 1 [8-360]
Ligand
BDBM193756
Substrate
Meas. Tech.
ERK-2 Enzymatic Assay
pH
7.3±n/a
IC50
0.90±n/a nM
Comments
extracted
Citation
 Blake, JFCook, AGaudino, JGunawardana, IWHicken, EJHunt, KWLyon, MMetcalf, ATMohr, PJMoreno, DANewhouse, BRen, LSchwarz, JChen, HGazzard, LSchmidt, JDo, S Serine/threonine kinase inhibitors US Patent  US9670208 Publication Date 6/6/2017 
Target
Name:
Mitogen-activated protein kinase 1 [8-360]
Synonyms:
ERK2 MAPK1 Mitogen Activated Kinase 1 Mitogen-activated protein kinase 1 (aa 8-360) PRKM2
Type:
Mol. Mass.:
40835.09
Organism:
Homo sapiens (Human)
Description:
P28482 aa 8-360
Residue:
353
  
Inhibitor
Name:
BDBM193756
Synonyms:
US9670208, Example 317 4-(3-((4,4-difluorocyclohexyl)methyl)-[1,2,4]triazolo[4,3-a]pyridin-7-yl)-N-(1-methyl-1H-pyrazol-5-yl)pyrimidin-2-amine
Type:
Small organic molecule
Emp. Form.:
C21H22F2N8
Mol. Mass.:
424.4498
SMILES:
Cn1nccc1Nc1nccc(n1)-c1ccn2c(CC3CCC(F)(F)CC3)nnc2c1
: