Target
Mitogen-activated protein kinase 1 [8-360]
Ligand
BDBM193778
Substrate
Meas. Tech.
ERK-2 Enzymatic Assay
pH
7.3±n/a
IC50
135±n/a nM
Comments
extracted
Citation
 Blake, JFCook, AGaudino, JGunawardana, IWHicken, EJHunt, KWLyon, MMetcalf, ATMohr, PJMoreno, DANewhouse, BRen, LSchwarz, JChen, HGazzard, LSchmidt, JDo, S Serine/threonine kinase inhibitors US Patent  US9670208 Publication Date 6/6/2017 
Target
Name:
Mitogen-activated protein kinase 1 [8-360]
Synonyms:
ERK2 MAPK1 Mitogen Activated Kinase 1 Mitogen-activated protein kinase 1 (aa 8-360) PRKM2
Type:
Mol. Mass.:
40835.09
Organism:
Homo sapiens (Human)
Description:
P28482 aa 8-360
Residue:
353
  
Inhibitor
Name:
BDBM193778
Synonyms:
US9670208, Example 419 4-(3-(1-(4-fluorophenyl)-5-methyl-1H-pyrazol-3-yl)-[1,2,4]triazolo[4,3-a]pyridin-7-yl)-N-(1-methyl-1H-pyrazol-4-yl)pyrimidin-2-amine
Type:
Small organic molecule
Emp. Form.:
C24H19FN10
Mol. Mass.:
466.4731
SMILES:
Cc1cc(nn1-c1ccc(F)cc1)-c1nnc2cc(ccn12)-c1ccnc(Nc2cnn(C)c2)n1
: