Target
Mitogen-activated protein kinase 1 [8-360]
Ligand
BDBM193780
Substrate
Meas. Tech.
ERK-2 Enzymatic Assay
pH
7.3±n/a
IC50
1.80±n/a nM
Comments
extracted
Citation
 Blake, JFCook, AGaudino, JGunawardana, IWHicken, EJHunt, KWLyon, MMetcalf, ATMohr, PJMoreno, DANewhouse, BRen, LSchwarz, JChen, HGazzard, LSchmidt, JDo, S Serine/threonine kinase inhibitors US Patent  US9670208 Publication Date 6/6/2017 
Target
Name:
Mitogen-activated protein kinase 1 [8-360]
Synonyms:
ERK2 MAPK1 Mitogen Activated Kinase 1 Mitogen-activated protein kinase 1 (aa 8-360) PRKM2
Type:
Mol. Mass.:
40835.09
Organism:
Homo sapiens (Human)
Description:
P28482 aa 8-360
Residue:
353
  
Inhibitor
Name:
BDBM193780
Synonyms:
US9670208, Example 467 N-(1-(3-chloro-4-fluorophenyl)-2-(7-(2-((1-methyl-1H-pyrazol-5-yl)amino)pyrimidin-4-yl)-[1,2,4]triazolo[4,3-a]pyridin-3-yl)ethyl)acetamide
Type:
Small organic molecule
Emp. Form.:
C24H21ClFN9O
Mol. Mass.:
505.935
SMILES:
CC(=O)NC(Cc1nnc2cc(ccn12)-c1ccnc(Nc2ccnn2C)n1)c1ccc(F)c(Cl)c1
: