Target
Mitogen-activated protein kinase 1 [8-360]
Ligand
BDBM193783
Substrate
Meas. Tech.
ERK-2 Enzymatic Assay
pH
7.3±n/a
IC50
661±n/a nM
Comments
extracted
Citation
 Blake, JFCook, AGaudino, JGunawardana, IWHicken, EJHunt, KWLyon, MMetcalf, ATMohr, PJMoreno, DANewhouse, BRen, LSchwarz, JChen, HGazzard, LSchmidt, JDo, S Serine/threonine kinase inhibitors US Patent  US9670208 Publication Date 6/6/2017 
Target
Name:
Mitogen-activated protein kinase 1 [8-360]
Synonyms:
ERK2 MAPK1 Mitogen Activated Kinase 1 Mitogen-activated protein kinase 1 (aa 8-360) PRKM2
Type:
Mol. Mass.:
40835.09
Organism:
Homo sapiens (Human)
Description:
P28482 aa 8-360
Residue:
353
  
Inhibitor
Name:
BDBM193783
Synonyms:
US9670208, Example 563 2-cyclopropyl-1-(7-(2-((1-methyl-1H-pyrazol-5-yl)amino)pyrimidin-4-yl)-[1,2,4]triazolo[4,3-a]pyridin-3-yl)propan-2-ol
Type:
Small organic molecule
Emp. Form.:
C20H22N8O
Mol. Mass.:
390.4417
SMILES:
Cn1nccc1Nc1nccc(n1)-c1ccn2c(CC(C)(O)C3CC3)nnc2c1
: