Target
Muscarinic acetylcholine receptor M3
Ligand
BDBM193802
Substrate
Meas. Tech.
Receptor Selection and Amplification Assays
EC50
500±n/a nM
Citation
 Burstein, ESEskildsen, JOlsson, R Muscarinic agonists US Patent  US9670209 Publication Date 6/6/2017 
Target
Name:
Muscarinic acetylcholine receptor M3
Synonyms:
ACM3_HUMAN Cholinergic, muscarinic M3 Muscarinic receptor M3 | RecName: Full=Muscarinic acetylcholine receptor M3
Type:
Enzyme
Mol. Mass.:
66151.03
Organism:
Homo sapiens (Human)
Description:
P20309
Residue:
590
  
Inhibitor
Name:
BDBM193802
Synonyms:
US9670209, Compound 312 1-((R)-3-(3-(cyclopropylmethoxy)-8-aza-bicyclo[3.2.1]octan-8-yl)-3-methylpropyl)-6-methyl-1H-indazole
Type:
Small organic molecule
Emp. Form.:
C22H33N3O
Mol. Mass.:
355.5169
SMILES:
COCC[C@@H]1C[C@@H]2CC[C@H](C1)N2C[C@@H](C)Cn1ncc2ccc(C)cc12
: