Target
Mu-type opioid receptor
Ligand
BDBM327436
Substrate
Meas. Tech.
Inhibition Assay
IC50
1.30±n/a nM
Citation
 Taniko, KMiyazawa, TKaneko, TKurumazuka, DHarada, SIzuchi, TOkabe, MIwamura, RTsuzaki, YSetoguchi, HImura, YAkaza, HShimizu, MKimura, T 3-azabicyclo[3.1.0]hexane derivative and use thereof for medical purpose US Patent  US9663463 Publication Date 5/30/2017 
Target
Name:
Mu-type opioid receptor
Synonyms:
M-OR-1 MOR-1 MUOR1 Mu opiate receptor OPRM1 hMOP | mu-type opioid receptor isoform MOR-1
Type:
G Protein-Coupled Receptor (GPCR)
Mol. Mass.:
44789.51
Organism:
Homo sapiens (Human)
Description:
P35372
Residue:
400
  
Inhibitor
Name:
BDBM327436
Synonyms:
N-(3-{(1R,5S,6r)-3-[3-(1-ethoxy-4,4-difluorocyclohexyl)propyl]-6-ethyl-3-azabicyclo[3.1.0]hexan-6-yl}phenyl)cyclopropanesulfonamide | US9663463, 14-(b)
Type:
Small organic molecule
Emp. Form.:
C27H40F2N2O3S
Mol. Mass.:
510.68
SMILES:
CCOC1(CCCN2C[C@H]3[C@@H](C2)C3(CC)c2cccc(NS(=O)(=O)C3CC3)c2)CCC(F)(F)CC1
: