Target
RAC-alpha serine/threonine-protein kinase
Ligand
BDBM11820
Substrate
Biotinylated Peptide Substrate
Meas. Tech.
PKB In Vitro Kinase Assay
pH
7.5±n/a
Temperature
295.15±n/a K
IC50
20±18 nM
Citation
 Breitenlechner, CBFriebe, WGBrunet, EWerner, GGraul, KThomas, UKunkele, KPSchafer, WGassel, MBossemeyer, DHuber, REngh, RAMasjost, B Design and crystal structures of protein kinase B-selective inhibitors in complex with protein kinase A and mutants. J Med Chem 48:163-70 (2005)  
Target
Name:
RAC-alpha serine/threonine-protein kinase
Synonyms:
AKT phosphorylation (p-AKT) AKT1/PPP1CA C-AKT PKB alpha Protein kinase B Protein kinase B (Akt 1) Protein kinase B alpha Proto-oncogene Akt (Akt1) Proto-oncogene c-Akt (AKT1) RAC-PK-alpha RAC-alpha serine/threonine-protein kinase (AKT1) | RAC-alpha serine/threonine-protein kinase (pAKT)
Type:
Enzyme
Mol. Mass.:
55681.25
Organism:
Homo sapiens (Human)
Description:
P31749
Residue:
480
  
Inhibitor
Name:
BDBM11820
Synonyms:
(3R,4R)-N-(4-{4-[5-(3,3-dimethylpiperidin-1-yl)-2-hydroxybenzoyl]benzoylamino}azepan-3-yl)isonicotinamide hydrochloride Protein Kinase B-Selective Inhibitor 4
Type:
Small organic molecule
Emp. Form.:
C33H39N5O4
Mol. Mass.:
569.6939
SMILES:
CC1(C)CCCN(C1)c1ccc(O)c(c1)C(=O)c1ccc(cc1)C(=O)N[C@@H]1CCCNC[C@H]1NC(=O)c1ccncc1
:
Substrate
Name:
Biotinylated Peptide Substrate
Synonyms:
Type:
Peptide
Mol. Mass.:
1764.91
Organism:
Description:
Residue:
17
ITINSGRARTSSFAEPG