Target
Neutrophil collagenase
Ligand
BDBM11863
Substrate
MMP Fluorogenic Peptide Substrate
Meas. Tech.
Enzyme Inhibition Assay
Ki
1.8±n/a nM
Citation
 Becker, DPVillamil, CIBarta, TEBedell, LJBoehm, TLDecrescenzo, GAFreskos, JNGetman, DPHockerman, SHeintz, RHoward, SCLi, MHMcDonald, JJCarron, CPFunckes-Shippy, CLMehta, PPMunie, GESwearingen, CA Synthesis and structure-activity relationships of beta- and alpha-piperidine sulfone hydroxamic acid matrix metalloproteinase inhibitors with oral antitumor efficacy. J Med Chem 48:6713-30 (2005)  
Target
Name:
Neutrophil collagenase
Synonyms:
CLG1 MMP8 Matrix metalloproteinase-8 PMNL collagenase | PMNL-CL
Type:
Enzyme
Mol. Mass.:
53413.48
Organism:
Homo sapiens (Human)
Description:
P22894
Residue:
467
  
Inhibitor
Name:
BDBM11863
Synonyms:
4-({[4-(4-chlorophenoxy)benzene]sulfonyl}methyl)-N-hydroxyoxane-4-carboxamide RS 130830 alpha-tetrahydropyran beta-sulfone 1B
Type:
Small organic molecule
Emp. Form.:
C19H20ClNO6S
Mol. Mass.:
425.883
SMILES:
ONC(=O)C1(CS(=O)(=O)c2ccc(Oc3ccc(Cl)cc3)cc2)CCOCC1
:
Substrate
Name:
MMP Fluorogenic Peptide Substrate
Synonyms:
Type:
Peptide
Mol. Mass.:
2468.31
Organism:
Description:
Residue:
23