Target
Matrix metalloproteinase-9
Ligand
BDBM11873
Substrate
MMP Fluorogenic Peptide Substrate
Meas. Tech.
Enzyme Inhibition Assay
Ki
0.29±n/a nM
Citation
 Becker, DPVillamil, CIBarta, TEBedell, LJBoehm, TLDecrescenzo, GAFreskos, JNGetman, DPHockerman, SHeintz, RHoward, SCLi, MHMcDonald, JJCarron, CPFunckes-Shippy, CLMehta, PPMunie, GESwearingen, CA Synthesis and structure-activity relationships of beta- and alpha-piperidine sulfone hydroxamic acid matrix metalloproteinase inhibitors with oral antitumor efficacy. J Med Chem 48:6713-30 (2005)  
Target
Name:
Matrix metalloproteinase-9
Synonyms:
67 kDa matrix metalloproteinase-9 92 kDa gelatinase CLG4B Gelatinase B MMP9 Matrix metalloproteinase 9 (MMP-9) Matrix metalloproteinase-9 (MMP9)
Type:
Enzyme
Mol. Mass.:
78452.28
Organism:
Homo sapiens (Human)
Description:
P14780
Residue:
707
  
Inhibitor
Name:
BDBM11873
Synonyms:
N-Hydroxy-1-methyl-4-{[4-(phenoxyphenyl]sulfonyl}-piperidine-4-carboxamide Hydrochloride alpha-sulfone 27c
Type:
Small organic molecule
Emp. Form.:
C19H22N2O5S
Mol. Mass.:
390.453
SMILES:
CN1CCC(CC1)(C(=O)NO)S(=O)(=O)c1ccc(Oc2ccccc2)cc1
:
Substrate
Name:
MMP Fluorogenic Peptide Substrate
Synonyms:
Type:
Peptide
Mol. Mass.:
2468.31
Organism:
Description:
Residue:
23