Target
Collagenase 3
Ligand
BDBM11869
Substrate
MMP Fluorogenic Peptide Substrate
Meas. Tech.
Enzyme Inhibition Assay
Ki
0.8±n/a nM
Citation
 Becker, DPVillamil, CIBarta, TEBedell, LJBoehm, TLDecrescenzo, GAFreskos, JNGetman, DPHockerman, SHeintz, RHoward, SCLi, MHMcDonald, JJCarron, CPFunckes-Shippy, CLMehta, PPMunie, GESwearingen, CA Synthesis and structure-activity relationships of beta- and alpha-piperidine sulfone hydroxamic acid matrix metalloproteinase inhibitors with oral antitumor efficacy. J Med Chem 48:6713-30 (2005)  
Target
Name:
Collagenase 3
Synonyms:
MMP-13 MMP13_HUMAN Matrix metalloproteinase-13 (MMP-13) | Matrix metalloproteinase-13 (MMP13)
Type:
Enzyme
Mol. Mass.:
53808.06
Organism:
Homo sapiens (Human)
Description:
P45452
Residue:
471
  
Inhibitor
Name:
BDBM11869
Synonyms:
4-({[4-(3,4-Dimethylphenoxy)phenyl]sulfonyl}methyl)-N-hydroxy-1-prop-2-ynylpiperidine-4-carboxamide Hydrochloride beta-sulfone 7f
Type:
Small organic molecule
Emp. Form.:
C24H28N2O5S
Mol. Mass.:
456.555
SMILES:
Cc1ccc(Oc2ccc(cc2)S(=O)(=O)CC2(CCN(CC#C)CC2)C(=O)NO)cc1C
:
Substrate
Name:
MMP Fluorogenic Peptide Substrate
Synonyms:
Type:
Peptide
Mol. Mass.:
2468.31
Organism:
Description:
Residue:
23