Target
Sphingosine 1-phosphate receptor 2
Ligand
BDBM329376
Substrate
Meas. Tech.
In Vitro Binding Assay
IC50
5.00±n/a nM
Citation
 Swenson, RE Sphingosine 1-phosphate receptor antagonists US Patent  US9663511 Publication Date 5/30/2017 
Target
Name:
Sphingosine 1-phosphate receptor 2
Synonyms:
EDG5 S1PR2 Sphingosine 1-phosphate receptor Sphingosine-1-phosphate receptor 2 | ndothelial differentiation G-protein coupled receptor 5
Type:
G Protein-Coupled Receptor (GPCR)
Mol. Mass.:
38883.16
Organism:
Homo sapiens (Human)
Description:
Membranes isolated from S1P2-transfected CHO cells were used in ligand binding assay.
Residue:
353
  
Inhibitor
Name:
BDBM329376
Synonyms:
US9663511, Compound 33.
Type:
Small organic molecule
Emp. Form.:
C19H23Cl2N7O2
Mol. Mass.:
452.338
SMILES:
CC(C)c1cc(NNC(=O)Nc2cc(Cl)nc(Cl)c2)nc2c(CCCO)nn(C)c12
: