Target
Phosphatidylinositol 4,5-bisphosphate 3-kinase catalytic subunit delta isoform
Ligand
BDBM195395
Substrate
Meas. Tech.
Luciferase-Coupled Chemiluminescence Assay
IC50
1000±n/a nM
Citation
 Leahy, JW Inhibitors of PI3K-delta and methods of their use and manufacture US Patent  US9670212 Publication Date 6/6/2017 
Target
Name:
Phosphatidylinositol 4,5-bisphosphate 3-kinase catalytic subunit delta isoform
Synonyms:
PI3-kinase p110 subunit delta PI3-kinase subunit p110-delta PIK3CD Phosphatidylinositol 4,5-biphosphate 3-kinase catalytic subunit delta (PIK3CD) Phosphatidylinositol 4,5-bisphosphate 3-kinase 110 kDa catalytic subunit delta (PI3K delta) Phosphatidylinositol 4,5-bisphosphate 3-kinase catalytic subunit delta (PI3Kdelta) Phosphatidylinositol 4,5-bisphosphate 3-kinase catalytic subunit delta isoform (PI3K delta) Phosphatidylinositol 4,5-bisphosphate 3-kinase catalytic subunit delta isoform (PI3K-delta) Phosphatidylinositol 4,5-bisphosphate 3-kinase catalytic subunit delta isoform (PI3Kdelta)
Type:
Enzyme Subunit
Mol. Mass.:
119489.41
Organism:
Homo sapiens (Human)
Description:
O00329
Residue:
1044
  
Inhibitor
Name:
BDBM195395
Synonyms:
US9670212, 54 3-amino-N-({2-[4-(1H-imidazol-1-ylacetyl)-1,4-diazepan-1-yl]-8-methylquinolin-3-yl}methyl)pyrazine-2-carboxamide
Type:
Small organic molecule
Emp. Form.:
C26H29N9O2
Mol. Mass.:
499.5676
SMILES:
Cc1cccc2cc(CNC(=O)c3nccnc3N)c(nc12)N1CCCN(CC1)C(=O)Cn1ccnc1
: