Target
cAMP and cAMP-inhibited cGMP 3',5'-cyclic phosphodiesterase 10A
Ligand
BDBM329421
Substrate
Meas. Tech.
Fluorescence Polarization Assay
Ki
0.010±n/a nM
Citation
 Kuduk, SDMcComas, CCReger, TS Pyrimidine PDE10 inhibitors US Patent  US9663513 Publication Date 5/30/2017 
Target
Name:
cAMP and cAMP-inhibited cGMP 3',5'-cyclic phosphodiesterase 10A
Synonyms:
3',5'-cyclic phosphodiesterase PDE10_HUMAN Phosphodiesterase 10A
Type:
Protein
Mol. Mass.:
88412.52
Organism:
Homo sapiens (Human)
Description:
Q9Y233
Residue:
779
  
Inhibitor
Name:
BDBM329421
Synonyms:
1-(4-(2-methyl-4- (((1S,2S)-2-(quinolin-2- yl)cyclopropyl)methoxy) pyrimidin-5- yl)phenyl)ethanol (enantiomer A) US9663513, 35
Type:
Small organic molecule
Emp. Form.:
C26H25N3O2
Mol. Mass.:
411.4956
SMILES:
CC(O)c1ccc(cc1)-c1cnc(C)nc1OC[C@H]1C[C@@H]1c1ccc2ccccc2n1
: