Target
Nuclear receptor ROR-gamma
Ligand
BDBM329651
Substrate
Meas. Tech.
Binding Assay
Ki
<100±n/a nM
Citation
 Claremon, DADillard, LWDong, CFan, YLotesta, SDMarcus, ASingh, SBTice, CMYuan, JZhao, WZhuang, L Dihydropyrrolopyridine inhibitors of ROR-gamma US Patent  US9663515 Publication Date 5/30/2017 
Target
Name:
Nuclear receptor ROR-gamma
Synonyms:
NR1F3 Nuclear receptor ROR-gamma (RORC) RAR-related orphan receptor C (RORc) RORG RZRG Retinoid-related orphan receptor-gamma (RORc)
Type:
Enzyme Catalytic Domain
Mol. Mass.:
58218.40
Organism:
Homo sapiens (Human)
Description:
P51449
Residue:
518
  
Inhibitor
Name:
BDBM329651
Synonyms:
US9663515, Compound 7
Type:
Small organic molecule
Emp. Form.:
C30H40F3N3O4S
Mol. Mass.:
595.717
SMILES:
CCOC[C@H](NC(=O)c1cnc2[C@H](CC)N(C[C@H]3CC[C@@H](CC3)C(F)(F)F)Cc2c1)c1ccc(cc1)S(=O)(=O)CC
: