Target
Epidermal growth factor receptor
Ligand
BDBM50383274
Substrate
Meas. Tech.
EGFR kinase assay
Temperature
298.15±n/a K
IC50
9.58±n/a nM
Comments
extracted
Citation
 Li, HXu, YZhao, ZLiu, XZhou, WBai, FXue, MZhang, LZhang, Y Pteridine ketone derivative and applications thereof as EGFR, BLK, and FLT3 inhibitor US Patent  US9670213 Publication Date 6/6/2017 
Target
Name:
Epidermal growth factor receptor
Synonyms:
EGF Receptor Substrate EGFR_HUMAN ERBB1 Epidermal Growth Factor Receptor erbB-1 Epidermal growth factor receptor (EGFR) HER1 Proto-oncogene c-ErbB-1 Tyrosine-Protein Kinase ErbB-1
Type:
Receptor Kinase Domain
Mol. Mass.:
134279.59
Organism:
Homo sapiens (Human)
Description:
P00533
Residue:
1210
  
Inhibitor
Name:
BDBM50383274
Synonyms:
CHEMBL1229592 US9670213, WZ4002
Type:
Small organic molecule
Emp. Form.:
C25H27ClN6O3
Mol. Mass.:
494.973
SMILES:
COc1cc(ccc1Nc1ncc(Cl)c(Oc2cccc(NC(=O)C=C)c2)n1)N1CCN(C)CC1
: