Target
Phosphatidylinositol 3-kinase regulatory subunit alpha
Ligand
BDBM330258
Substrate
Meas. Tech.
Inhibition on PI3K Kinase Activity
IC50
9.59±n/a nM
Citation
 Yang, CMeng, LChen, YWang, XTan, CLi, JDing, JChen, Y Pyrrolo[2,1-F[1,2,4]triazine compounds, preparation methods and applications thereof US Patent  US9724352 Publication Date 8/8/2017 
Target
Name:
Phosphatidylinositol 3-kinase regulatory subunit alpha
Synonyms:
GRB1 PI3-kinase class I PI3-kinase p85-alpha subunit PI3-kinase subunit p85-alpha PIK3CG/PIK3R1 Phosphatidylinositol 3-kinase 85 kDa regulatory subunit alpha (PI3K alpha) Phosphatidylinositol 3-kinase regulatory subunit alpha (PIK3R1) Phosphatidylinositol 3-kinase regulatory subunit alpha isoform 1 (PI3 Kinase alpha) Phosphatidylinositol 4,5-bisphosphate 3-kinase catalytic subunit alpha isoform (PI3Kalpha) PtdIns-3-kinase p85-alpha p85 alpha
Type:
Protein
Mol. Mass.:
83592.82
Organism:
Homo sapiens (Human)
Description:
P27986
Residue:
724
  
Inhibitor
Name:
BDBM330258
Synonyms:
1-(4-(4-methylpiperazine-carbonyl)phenyl)-3-(4-(6-((4-(methylsulfonyl)piperazin-1-yl)methyl)-4-morpholinopyrrolo[2,1-f][1,2,4]triazin-2-yl)phenyl)urea | US9724352, I-22
Type:
Small organic molecule
Emp. Form.:
C35H44N10O5S
Mol. Mass.:
716.853
SMILES:
CN1CCN(CC1)C(=O)c1ccc(NC(=O)Nc2ccc(cc2)-c2nc(N3CCOCC3)c3cc(CN4CCN(CC4)S(C)(=O)=O)cn3n2)cc1
: