Target
Phosphatidylinositol 3-kinase regulatory subunit alpha
Ligand
BDBM330292
Substrate
Meas. Tech.
Inhibition on PI3K Kinase Activity
IC50
9.30±n/a nM
Citation
 Yang, CMeng, LChen, YWang, XTan, CLi, JDing, JChen, Y Pyrrolo[2,1-F[1,2,4]triazine compounds, preparation methods and applications thereof US Patent  US9724352 Publication Date 8/8/2017 
Target
Name:
Phosphatidylinositol 3-kinase regulatory subunit alpha
Synonyms:
GRB1 PI3-kinase class I PI3-kinase p85-alpha subunit PI3-kinase subunit p85-alpha PIK3CG/PIK3R1 Phosphatidylinositol 3-kinase 85 kDa regulatory subunit alpha (PI3K alpha) Phosphatidylinositol 3-kinase regulatory subunit alpha (PIK3R1) Phosphatidylinositol 3-kinase regulatory subunit alpha isoform 1 (PI3 Kinase alpha) Phosphatidylinositol 4,5-bisphosphate 3-kinase catalytic subunit alpha isoform (PI3Kalpha) PtdIns-3-kinase p85-alpha p85 alpha
Type:
Protein
Mol. Mass.:
83592.82
Organism:
Homo sapiens (Human)
Description:
P27986
Residue:
724
  
Inhibitor
Name:
BDBM330292
Synonyms:
1-(4-fluorophenyl)-3-(5-(6-((4-(methylsulfonyl)piperazin-1-yl)methyl)-4-morpholinopyrrolo[2,1-f][1,2,4]triazin-2-yl)-4-(trifluoromethyl)pyridin-2-yl)urea | US9724352, I-28
Type:
Small organic molecule
Emp. Form.:
C29H31F4N9O4S
Mol. Mass.:
677.673
SMILES:
CS(=O)(=O)N1CCN(Cc2cc3c(nc(nn3c2)-c2cnc(NC(=O)Nc3ccc(F)cc3)cc2C(F)(F)F)N2CCOCC2)CC1
: