Target
Sigma intracellular receptor 2
Ligand
BDBM50353846
Substrate
Meas. Tech.
Receptor Assay
Ki
1.09±0.03 nM
Citation
 McCurdy, CRMesangeau, CChin, FTJames, MLShen, BGambhir, SBiswal, SBehera, D Highly selective sigma receptor ligands and radioligands as probes in nociceptive processing and the pathphysiological study of memory deficits and cognitive disorders US Patent  US9724435 Publication Date 8/8/2017 
Target
Name:
Sigma intracellular receptor 2
Synonyms:
S2r Sigma intracellular receptor 2 Sigma2 receptor Transmembrane protein 97
Type:
Protein
Mol. Mass.:
20953.88
Organism:
Rattus norvegicus (Rat)
Description:
Q5U3Y7
Residue:
176
  
Inhibitor
Name:
BDBM50353846
Synonyms:
CHEMBL1831156 US9724435, Compound CM-338
Type:
Small organic molecule
Emp. Form.:
C22H26FN3
Mol. Mass.:
351.4603
SMILES:
Fc1ccc(cc1)N1CCN(CCCCn2ccc3ccccc23)CC1
: