Target
Aurora kinase A
Ligand
BDBM12103
Substrate
CHOCKtide
Meas. Tech.
Kinase SPA Assay
pH
7.5±n/a
Temperature
295.15±n/a K
IC50
5±n/a nM
Citation
 Fancelli, DBerta, DBindi, SCameron, ACappella, PCarpinelli, PCatana, CForte, BGiordano, PGiorgini, MLMantegani, SMarsiglio, AMeroni, MMoll, JPittala, VRoletto, FSeverino, DSoncini, CStorici, PTonani, RVarasi, MVulpetti, AVianello, P Potent and selective Aurora inhibitors identified by the expansion of a novel scaffold for protein kinase inhibition. J Med Chem 48:3080-4 (2005)  
Target
Name:
Aurora kinase A
Synonyms:
AIK ARK1 AURKA AYK1 Aurora kinase A (AURA) Aurora kinase A (Aurora A) Aurora-related kinase 1 BTAK Breast-tumor-amplified kinase STK15 Serine/threonine kinase 15 Serine/threonine-protein kinase aurora A hARK1
Type:
Serine/threonine-protein kinase
Mol. Mass.:
45830.98
Organism:
Homo sapiens (Human)
Description:
O14965
Residue:
403
  
Inhibitor
Name:
BDBM12103
Synonyms:
1,4,5,6-Tetrahydropyrrolo[3,4-c]pyrazole 11 4-tert-butyl-N-{5-[2-(thiophen-2-yl)acetyl]-1H,4H,5H,6H-pyrrolo[3,4-c]pyrazol-3-yl}benzamide | CHEMBL484007
Type:
Small organic molecule
Emp. Form.:
C22H24N4O2S
Mol. Mass.:
408.517
SMILES:
CC(C)(C)c1ccc(cc1)C(=O)Nc1[nH]nc2CN(Cc12)C(=O)Cc1cccs1
:
Substrate
Name:
CHOCKtide
Synonyms:
Type:
Peptide
Mol. Mass.:
889.06
Organism:
Description:
Residue:
7
LRRWSLG