Target
Cytochrome P450 2A6
Ligand
BDBM12370
Substrate
BDBM12342
Meas. Tech.
CYP2A6 Inhibition Assay
Ki
300±n/a nM
Citation
 Yano, JKDenton, TTCerny, MAZhang, XJohnson, EFCashman, JR Synthetic inhibitors of cytochrome P-450 2A6: inhibitory activity, difference spectra, mechanism of inhibition, and protein cocrystallization. J Med Chem 49:6987-7001 (2006)  
Target
Name:
Cytochrome P450 2A6
Synonyms:
1,4-cineole 2-exo-monooxygenase CP2A6_HUMAN CYP2A6 Coumarin 7-hydroxylase Cytochrome P450 IIA3 | Cytochrome P450(I)
Type:
Protein
Mol. Mass.:
56514.34
Organism:
Homo sapiens (Human)
Description:
P11509
Residue:
494
  
Inhibitor
Name:
BDBM12370
Synonyms:
(3-(Pyridin-3-yl)-1H-pyrazol-5-yl)methanamine [3-(pyridin-3-yl)-1H-pyrazol-5-yl]methanamine | nicotine 3-heteroaromatic analogue 32
Type:
Small organic molecule
Emp. Form.:
C9H10N4
Mol. Mass.:
174.2025
SMILES:
NCc1cc(n[nH]1)-c1cccnc1
:
Substrate
Name:
BDBM12342
Synonyms:
2H-chromen-2-one Coumarin
Type:
Natural product
Emp. Form.:
C9H6O2
Mol. Mass.:
146.1427
SMILES:
O=c1ccc2ccccc2o1
: