Target
Bromodomain-containing protein 4
Ligand
BDBM243343
Substrate
Meas. Tech.
Time Resolved Fluorescence Resonance Energy Transfer (TR-FRET) Assay
IC50
<50±n/a nM
Citation
 Poss, MATortolani, DRPurandare, AVTokarski, JSMussari, CPKamau, MGDodd, DSGavai, AVO Malley, DHuynh, TNVaccaro, WHarikrishnan, LS Carbazole compounds useful as bromodomain inhibitors US Patent  US10196387 Publication Date 2/5/2019 
Target
Name:
Bromodomain-containing protein 4
Synonyms:
BRD4 Bromodomain-containing protein 4 (BRD4) Protein HUNK1
Type:
Protein
Mol. Mass.:
152264.84
Organism:
Homo sapiens (Human)
Description:
O60885
Residue:
1362
  
Inhibitor
Name:
BDBM243343
Synonyms:
US10053454, Example 87 | US10196387, Example 87
Type:
Small organic molecule
Emp. Form.:
C26H26N4O6S
Mol. Mass.:
522.573
SMILES:
Cc1noc(C)c1-c1cc(C(N)=O)c2n(c3ccc(cc3c2c1)C(=O)N1CCOCC1)S(=O)(=O)C1CC1
: