Target
Plasma kallikrein
Ligand
BDBM12676
Substrate
BDBM12680
Meas. Tech.
Enzyme Assay and Determination of the Inhibition Constants.
Ki
>2300±n/a nM
Citation
 Quan, MLLam, PYHan, QPinto, DJHe, MYLi, REllis, CDClark, CGTeleha, CASun, JHAlexander, RSBai, SLuettgen, JMKnabb, RMWong, PCWexler, RR Discovery of 1-(3'-aminobenzisoxazol-5'-yl)-3-trifluoromethyl-N-[2-fluoro-4-[(2'-dimethylaminomethyl)imidazol-1-yl]phenyl]-1H-pyrazole-5-carboxyamide hydrochloride (razaxaban), a highly potent, selective, and orally bioavailable factor Xa inhibitor. J Med Chem 48:1729-44 (2005)  
Target
Name:
Plasma kallikrein
Synonyms:
Fletcher factor KLKB1 Kallikrein Plasma kallikrein heavy chain Plasma prekallikrein
Type:
Protein
Mol. Mass.:
71391.16
Organism:
Homo sapiens (Human)
Description:
P03952
Residue:
638
  
Inhibitor
Name:
BDBM12676
Synonyms:
1-(3-Aminobenzisoxazol-5-yl)-3-trifluoromethyl-N-[2-fluoro-4-[(2-dimethylaminomethyl)imidazol-1-yl]phenyl]-1H-pyrazole-5-carboxyamide Hydrochloride Salt BMS-561389 CHEMBL558198 Razaxaban
Type:
Small organic molecule
Emp. Form.:
C24H20F4N8O2
Mol. Mass.:
528.4616
SMILES:
CN(C)Cc1nccn1-c1ccc(NC(=O)c2cc(nn2-c2ccc3onc(N)c3c2)C(F)(F)F)c(F)c1
:
Substrate
Name:
BDBM12680
Synonyms:
(2S)-N-[(2S)-5-carbamimidamido-2-[(4-nitrophenyl)amino]pentanoyl]-3-phenyl-2-[(2R)-pyrrolidin-2-ylformamido]propanamide H-D-Pro-Phe-Arg-p-nitroanilide | prolyl-phenylalanyl-arginine-p-nitroanilide
Type:
Small organic molecule
Emp. Form.:
C26H34N8O5
Mol. Mass.:
538.5988
SMILES:
N\C([NH-])=[NH+]/CCCC(NC(=O)C(Cc1ccccc1)NC(=O)C1CCCN1)C(=O)Nc1ccc(cc1)[N+]([O-])=O
: