Target
Coagulation factor IX
Ligand
BDBM12750
Substrate
BDBM12774
Meas. Tech.
Enzyme Assay and Determination of the Inhibition Constants.
Ki
82±n/a nM
Citation
 Smallheer, JMAlexander, RSWang, JWang, SNakajima, SRossi, KASmallwood, ABarbera, FBurdick, DLuettgen, JMKnabb, RMWexler, RRJadhav, PK SAR and factor IXa crystal structure of a dual inhibitor of factors IXa and Xa. Bioorg Med Chem Lett 14:5263-7 (2004)  
Target
Name:
Coagulation factor IX
Synonyms:
Christmas factor Coagulation factor IX/VIII Coagulation factor IXa heavy chain F9 Factor IX Factor IXa (fIXa) Plasma thromboplastin component
Type:
Enzyme
Mol. Mass.:
51768.83
Organism:
Homo sapiens (Human)
Description:
P00740
Residue:
461
  
Inhibitor
Name:
BDBM12750
Synonyms:
N-[4-(1H-1,3-benzodiazol-1-yl)phenyl]-1-(3-carbamimidoylphenyl)-3-methyl-1H-pyrazole-5-carboxamide | pyrazole analog 1
Type:
Small organic molecule
Emp. Form.:
C25H21N7O
Mol. Mass.:
435.4805
SMILES:
Cc1cc(C(=O)Nc2ccc(cc2)-n2cnc3ccccc23)n(n1)-c1cccc(c1)C(N)=N
:
Substrate
Name:
BDBM12774
Synonyms:
(2S)-5-carbamimidamido-2-{2-[(2R)-3-(4-hydroxycyclohexyl)-2-methanesulfonamidopropanamido]acetamido}-N-(4-nitrophenyl)pentanamide; acetic acid Factor IX Chromogenic Substrate Methylsulfonyl-D-hexahydrotyrosyl-glycyl-arginine-4-nitroanilide Spectrozyme tPA | tPA/Trypsin Substrate
Type:
Small organic molecule
Emp. Form.:
C24H38N8O8S
Mol. Mass.:
598.672
SMILES:
CS(=O)(=O)NC(CC1CCC(O)CC1)C(=O)NCC(=O)NC(CCC\[NH+]=C(\N)[NH-])C(=O)Nc1ccc(cc1)[N+]([O-])=O
: