Target
Receptor tyrosine-protein kinase erbB-4
Ligand
BDBM333447
Substrate
IC50
1.70±n/a nM
Citation
 Huang, ZDong, Y Quinazoline derivatives substituted by aniline, preparation method and use thereof US Patent  US9730934 Publication Date 8/15/2017 
Target
Name:
Receptor tyrosine-protein kinase erbB-4
Synonyms:
ERBB4 Epidermal growth factor receptor ErbB-4 (HER4) Tyrosine Kinase Proto-oncogene c-ErbB-4 Receptor protein-tyrosine kinase erbB-4 Tyrosine kinase-type cell surface receptor HER4 (HER4)
Type:
Protein
Mol. Mass.:
146803.56
Organism:
Homo sapiens (Human)
Description:
Q15303
Residue:
1308
  
Inhibitor
Name:
BDBM333447
Synonyms:
N-[4-(3-chloro-4- fluorophenylamino)-7-(8-methyl-1- oxa-8-azaspiro[4.5]decan-2- ylmethoxy)quinazolin-6-yl]- acrylamide US9730934, Compound 7
Type:
Small organic molecule
Emp. Form.:
C27H29ClFN5O3
Mol. Mass.:
526.002
SMILES:
CN1CCC2(CCC(COc3cc4ncnc(Nc5ccc(F)c(Cl)c5)c4cc3NC(=O)C=C)O2)CC1
: