Target
Receptor tyrosine-protein kinase erbB-4
Ligand
BDBM333448
Substrate
IC50
3.40±n/a nM
Citation
 Huang, ZDong, Y Quinazoline derivatives substituted by aniline, preparation method and use thereof US Patent  US9730934 Publication Date 8/15/2017 
Target
Name:
Receptor tyrosine-protein kinase erbB-4
Synonyms:
ERBB4 Epidermal growth factor receptor ErbB-4 (HER4) Tyrosine Kinase Proto-oncogene c-ErbB-4 Receptor protein-tyrosine kinase erbB-4 Tyrosine kinase-type cell surface receptor HER4 (HER4)
Type:
Protein
Mol. Mass.:
146803.56
Organism:
Homo sapiens (Human)
Description:
Q15303
Residue:
1308
  
Inhibitor
Name:
BDBM333448
Synonyms:
N-[4-(3-chloro-4- fluorophenylamino)-7-(2- ((1R,5S,6S)-3-methyl-3- azabicyclo[3.1.0]hexan-6- ylethoxy)quinazolin-6-yl]- acrylamide US9730934, Compound 8
Type:
Small organic molecule
Emp. Form.:
C25H25ClFN5O2
Mol. Mass.:
481.95
SMILES:
CN1C[C@H]2[C@H](CCOc3cc4ncnc(Nc5ccc(F)c(Cl)c5)c4cc3NC(=O)C=C)[C@H]2C1
: