Target
Receptor tyrosine-protein kinase erbB-4
Ligand
BDBM333449
Substrate
IC50
8.30±n/a nM
Citation
 Huang, ZDong, Y Quinazoline derivatives substituted by aniline, preparation method and use thereof US Patent  US9730934 Publication Date 8/15/2017 
Target
Name:
Receptor tyrosine-protein kinase erbB-4
Synonyms:
ERBB4 Epidermal growth factor receptor ErbB-4 (HER4) Tyrosine Kinase Proto-oncogene c-ErbB-4 Receptor protein-tyrosine kinase erbB-4 Tyrosine kinase-type cell surface receptor HER4 (HER4)
Type:
Protein
Mol. Mass.:
146803.56
Organism:
Homo sapiens (Human)
Description:
Q15303
Residue:
1308
  
Inhibitor
Name:
BDBM333449
Synonyms:
N-[4-(3-chloro-4- fluorophenylamino)-7-(2-(3-methyl- 3-azabicyclo[3.2.1]octan-8- yl)ethoxy)quinazolin-6-yl]- acrylamide US9730934, Compound 11
Type:
Small organic molecule
Emp. Form.:
C27H29ClFN5O2
Mol. Mass.:
510.003
SMILES:
CN1CC2CCC(C1)C2CCOc1cc2ncnc(Nc3ccc(F)c(Cl)c3)c2cc1NC(=O)C=C
: