Target
Epidermal growth factor receptor
Ligand
BDBM333465
Substrate
Meas. Tech.
In Vitro Enzyme Inhibition Assay
IC50
0.390±n/a nM
Citation
 Huang, ZDong, Y Quinazoline derivatives substituted by aniline, preparation method and use thereof US Patent  US9730934 Publication Date 8/15/2017 
Target
Name:
Epidermal growth factor receptor
Synonyms:
EGF Receptor Substrate EGFR_HUMAN ERBB1 Epidermal Growth Factor Receptor erbB-1 Epidermal growth factor receptor (EGFR) HER1 Proto-oncogene c-ErbB-1 Tyrosine-Protein Kinase ErbB-1
Type:
Receptor Kinase Domain
Mol. Mass.:
134279.59
Organism:
Homo sapiens (Human)
Description:
P00533
Residue:
1210
  
Inhibitor
Name:
BDBM333465
Synonyms:
N-[4-(3-chloro-4- fluorophenylamino)-7-(2-(6-methyl- 6-azaspiro[2.5]octan-1- yl)ethoxy)quinazolin-6-yl]- acrylamide US9730934, Compound 14
Type:
Small organic molecule
Emp. Form.:
C27H29ClFN5O2
Mol. Mass.:
510.003
SMILES:
CN1CCC2(CC2CCOc2cc3ncnc(Nc4ccc(F)c(Cl)c4)c3cc2NC(=O)C=C)CC1
: