Target
RAF proto-oncogene serine/threonine-protein kinase
Ligand
BDBM333838
Substrate
Meas. Tech.
Competition Binding Assay
Kd
<250±n/a nM
Citation
 Abraham, SBhagwat, SSCampbell, BTChao, QFaraoni, RHolladay, MWLai, AGRowbottom, MWSetti, ESprankle, KG RAF kinase modulator compounds and methods of use thereof US Patent  US9730937 Publication Date 8/15/2017 
Target
Name:
RAF proto-oncogene serine/threonine-protein kinase
Synonyms:
C-Raf Protein Kinase RAF RAF1 Raf-1 Serine/threonine-protein kinase C-Raf | cRaf
Type:
Serine/threonine-protein kinase
Mol. Mass.:
73082.52
Organism:
Homo sapiens (Human)
Description:
P04049
Residue:
648
  
Inhibitor
Name:
BDBM333838
Synonyms:
Example 388 Preparation of 1- (5- (1,3-difluoro-2- methylpropan-2- yl) isoxazol-3-yl)-3- (3- (7-ethoxy-6- methoxy- quinazolin- 4- ylthio)phenyl) urea | US9730937, Example 0
Type:
Small organic molecule
Emp. Form.:
C25H25F2N5O4S
Mol. Mass.:
529.559
SMILES:
CCOc1cc2ncnc(Sc3cccc(NC(=O)Nc4cc(on4)C(C)(CF)CF)c3)c2cc1OC
: