Target
Carbonic anhydrase 14
Ligand
BDBM13056
Substrate
BDBM10856
Meas. Tech.
CA Inhibition Assay
Ki
24±n/a nM
Citation
 Winum, JYTemperini, CEl Cheikh, KInnocenti, AVullo, DCiattini, SMontero, JLScozzafava, ASupuran, CT Carbonic anhydrase inhibitors: clash with Ala65 as a means for designing inhibitors with low affinity for the ubiquitous isozyme II, exemplified by the crystal structure of the topiramate sulfamide analogue. J Med Chem 49:7024-31 (2006)  
Target
Name:
Carbonic anhydrase 14
Synonyms:
CA-XIV CAH14_HUMAN Carbonic Anhydrase XIV Carbonic anhydrase 14 Carbonic anhydrase XIV (CA XIV)
Type:
Enzyme
Mol. Mass.:
37665.67
Organism:
Homo sapiens (Human)
Description:
Human (cloned) isozyme.
Residue:
337
  
Inhibitor
Name:
BDBM13056
Synonyms:
(4S)-4-(ethylamino)-2-(3-methoxypropyl)-1,1-dioxo-2H,3H,4H-1,7,2-thieno[3,2-e][1,2]thiazine-6-sulfonamide sulfonamide 6
Type:
Small organic molecule
Emp. Form.:
C12H21N3O5S3
Mol. Mass.:
383.507
SMILES:
CCN[C@@H]1CN(CCCOC)S(=O)(=O)c2sc(cc12)S(N)(=O)=O
:
Substrate
Name:
BDBM10856
Synonyms:
Carbon Dioxide | methanedione
Type:
Small organic molecule
Emp. Form.:
CO2
Mol. Mass.:
44.0095
SMILES:
O=C=O
: