Target
Epidermal growth factor receptor [T790M,L858R]
Ligand
BDBM200805
Substrate
Meas. Tech.
TBD
IC50
22.0±n/a nM
Citation
 Zhou, CZhang, G Fused tricyclic amide compounds as multiple kinase inhibitors US Patent  US9670231 Publication Date 6/6/2017 
Target
Name:
Epidermal growth factor receptor [T790M,L858R]
Synonyms:
EGFR EGFR_HUMAN ERBB1 Epidermal growth factor receptor (EGFR)(T790M/L858R) Epidermal growth factor receptor (T790M, L858R) Epidermal growth factor receptor(L858R, T790M) | HER1
Type:
Mol. Mass.:
134353.72
Organism:
Homo sapiens (Human)
Description:
P00533[T790M,L858R]
Residue:
1210
  
Inhibitor
Name:
BDBM200805
Synonyms:
US9670231, 2.3
Type:
Small organic molecule
Emp. Form.:
C31H32F3N5O4
Mol. Mass.:
595.6121
SMILES:
CCN1CCN(Cc2ccc(cc2C(F)(F)F)C(=O)N[C@@H]2[C@H]3Oc4ccc(Oc5ccnc(c5)C(=O)NC)cc4[C@@H]23)CC1
: