Target
Tyrosine-protein kinase Lck
Ligand
BDBM13264
Substrate
Enolase
Meas. Tech.
Lck Kinase Inhibition Assay
IC50
4.9±n/a nM
Citation
 Das, JChen, PNorris, DPadmanabha, RLin, JMoquin, RVShen, ZCook, LSDoweyko, AMPitt, SPang, SShen, DRFang, Qde Fex, HFMcIntyre, KWShuster, DJGillooly, KMBehnia, KSchieven, GLWityak, JBarrish, JC 2-aminothiazole as a novel kinase inhibitor template. Structure-activity relationship studies toward the discovery of N-(2-chloro-6-methylphenyl)-2-[[6-[4-(2-hydroxyethyl)-1- piperazinyl)]-2-methyl-4-pyrimidinyl]amino)]-1,3-thiazole-5-carboxamide (dasatinib, BMS-354825) as a potent pan-Src kinase i J Med Chem 49:6819-32 (2006)  
Target
Name:
Tyrosine-protein kinase Lck
Synonyms:
2.7.10.2 LCK_HUMAN Leukocyte C-terminal Src kinase Lymphocyte-specific protein tyrosine kinase Protein YT16 Proto-oncogene tyrosine-protein kinase LCK T cell-specific protein-tyrosine kinase
Type:
Mol. Mass.:
57987.83
Organism:
Homo sapiens (Human)
Description:
P06239
Residue:
509
  
Inhibitor
Name:
BDBM13264
Synonyms:
2-(pyrazin-2-ylamino)-N-(2,4,6-trimethylphenyl)-1,3-thiazole-5-carboxamide | BMS-354825 2-Heteroarylamino-thiazole Analog 12i
Type:
Small organic molecule
Emp. Form.:
C17H17N5OS
Mol. Mass.:
339.415
SMILES:
Cc1cc(C)c(NC(=O)c2cnc(Nc3cnccn3)s2)c(C)c1
:
Substrate
Name:
Enolase
Synonyms:
Enolase 1
Type:
Other Protein Type
Mol. Mass.:
46670.83
Organism:
Saccharomyces cerevisiae
Description:
Acid denatured substrate.
Residue:
436