Target
Diacylglycerol O-acyltransferase 1
Ligand
BDBM321145
Substrate
Meas. Tech.
LE Assay
IC50
1.80±n/a nM
Citation
 Cheung, MTangirala, RS Compounds as diacylglycerol acyltransferase inhibitors US Patent  US9738658 Publication Date 8/22/2017 
Target
Name:
Diacylglycerol O-acyltransferase 1
Synonyms:
ACAT-related gene product 1 Acyl coA-diacylglycerol acyl transferase 1 (DGAT1) DGAT1 Diacylglycerol Acyltransferase (DGAT1) Diacylglycerol O-acyltransferase 1 (DGAT1) | Diglyceride acyltransferase
Type:
Protein
Mol. Mass.:
55297.82
Organism:
Homo sapiens (Human)
Description:
O75907
Residue:
488
  
Inhibitor
Name:
BDBM321145
Synonyms:
US10174049, Example 12 US9796729, 12
Type:
Small organic molecule
Emp. Form.:
C21H15Cl2N5O2
Mol. Mass.:
440.282
SMILES:
Nc1ncnc2OCCN(c3ccc4n(ccc4c3)-c3cccc(Cl)c3Cl)C(=O)c12
: