Target
Tyrosine-protein kinase ABL1 [201-500,Q252H]
Ligand
BDBM6572
Substrate
BDBM13531
Meas. Tech.
Kinase Assay and Binding Constant Measurement
Kd
2±n/a nM
Citation
 Carter, TAWodicka, LMShah, NPVelasco, AMFabian, MATreiber, DKMilanov, ZVAtteridge, CEBiggs, WHEdeen, PTFloyd, MFord, JMGrotzfeld, RMHerrgard, SInsko, DEMehta, SAPatel, HKPao, WSawyers, CLVarmus, HZarrinkar, PPLockhart, DJ Inhibition of drug-resistant mutants of ABL, KIT, and EGF receptor kinases. Proc Natl Acad Sci U S A 102:11011-6 (2005)  
Target
Name:
Tyrosine-protein kinase ABL1 [201-500,Q252H]
Synonyms:
ABL ABL1 JTK7 c-ABL | p150
Type:
Enzyme
Mol. Mass.:
34605.27
Organism:
Homo sapiens (Human)
Description:
P00519[201-500,Q252H]
Residue:
300
  
Inhibitor
Name:
BDBM6572
Synonyms:
6-(2,6-dichlorophenyl)-2-[(4-fluoro-3-methylphenyl)amino]-8-methyl-7H,8H-pyrido[2,3-d]pyrimidin-7-one PD-180970 | PD180970
Type:
Small organic molecule
Emp. Form.:
C21H15Cl2FN4O
Mol. Mass.:
429.274
SMILES:
Cc1cc(Nc2ncc3cc(-c4c(Cl)cccc4Cl)c(=O)n(C)c3n2)ccc1F
:
Substrate
Name:
BDBM13531
Synonyms:
4-(4-Fluorophenyl)-2-(4-hydroxyphenyl)-5-(4-pyridyl)-1H-imidazole 4-[4-(4-fluorophenyl)-5-(4-pyridyl)-4-imidazolin-2-ylidene]cyclohexa-2,5-dien-1-one SB-202190 biotinylated SB202190
Type:
Small organic molecule
Emp. Form.:
C20H14FN3O
Mol. Mass.:
331.3431
SMILES:
Oc1ccc(cc1)-c1nc(c([nH]1)-c1ccc(F)cc1)-c1ccncc1
: