Target
Tyrosine-protein kinase Mer
Ligand
BDBM336377
Substrate
Meas. Tech.
Inhibition Assay
IC50
55±n/a nM
Citation
 Wang, XLiu, JYang, CZhang, WFrye, SKireev, D Pyrazolopyrimidine compounds for the treatment of cancer US Patent  US9744172 Publication Date 8/29/2017 
Target
Name:
Tyrosine-protein kinase Mer
Synonyms:
MER MERTK Proto-oncogene c-Mer Receptor tyrosine kinase MerTK | Tyrosine-protein kinase Mer
Type:
PROTEIN
Mol. Mass.:
110234.77
Organism:
Homo sapiens (Human)
Description:
ChEMBL_1498723
Residue:
999
  
Inhibitor
Name:
BDBM336377
Synonyms:
US9744172, Compound UNC1030A
Type:
Small organic molecule
Emp. Form.:
C27H31FN6O3S
Mol. Mass.:
538.637
SMILES:
CCCCNc1ncc2c(nn(C3CC[C@H](O)CC3)c2n1)-c1ccc(cc1)S(=O)(=O)Nc1ccc(F)cc1
: