Target
Nuclear receptor ROR-gamma
Ligand
BDBM332454
Substrate
Meas. Tech.
Biochemical TR-FRET Assay
IC50
85.0±n/a nM
Citation
 Barr, KJBienstock, CEMaclean, JKZhang, HBeresis, RTZhang, DAnthony, NJLapointe, BTTian, Y 4-heteroaryl substituted benzoic acid compounds as RORgammaT inhibitors and uses thereof US Patent  US9745265 Publication Date 8/29/2017 
Target
Name:
Nuclear receptor ROR-gamma
Synonyms:
Nr1f3 Nuclear receptor subfamily 1 group F member 3 RORG_MOUSE Rorc TOR Thymus orphan receptor
Type:
PROTEIN
Mol. Mass.:
58133.31
Organism:
Mus musculus
Description:
ChEMBL_103664
Residue:
516
  
Inhibitor
Name:
BDBM332454
Synonyms:
4-(1-(2-chloro-6-(trifluoromethyl)benzoyl)-6-(2-oxo-imidazolidin-1-yl)-1H-indazol-3-yl)-3-fluorobenzoic acid (6A) US9745265, 6A
Type:
Small organic molecule
Emp. Form.:
C25H15ClF4N4O4
Mol. Mass.:
546.858
SMILES:
OC(=O)c1ccc(-c2nn(C(=O)c3c(Cl)cccc3C(F)(F)F)c3cc(ccc23)N2CCNC2=O)c(F)c1
: