Target
Nuclear receptor ROR-gamma
Ligand
BDBM332503
Substrate
Meas. Tech.
Biochemical TR-FRET Assay
IC50
>10000±n/a nM
Citation
 Barr, KJBienstock, CEMaclean, JKZhang, HBeresis, RTZhang, DAnthony, NJLapointe, BTTian, Y 4-heteroaryl substituted benzoic acid compounds as RORgammaT inhibitors and uses thereof US Patent  US9745265 Publication Date 8/29/2017 
Target
Name:
Nuclear receptor ROR-gamma
Synonyms:
Nr1f3 Nuclear receptor subfamily 1 group F member 3 RORG_MOUSE Rorc TOR Thymus orphan receptor
Type:
PROTEIN
Mol. Mass.:
58133.31
Organism:
Mus musculus
Description:
ChEMBL_103664
Residue:
516
  
Inhibitor
Name:
BDBM332503
Synonyms:
4-[1-{[2-chloro-6- (trifluoromethyl) phenyl]carbonyl}-6- (4-fluorophenyl)- 1H-indazol-3-yl]benzoic acid US9745265, 23I
Type:
Small organic molecule
Emp. Form.:
C28H15ClF4N2O3
Mol. Mass.:
538.877
SMILES:
OC(=O)c1ccc(cc1)-c1nn(C(=O)c2c(Cl)cccc2C(F)(F)F)c2cc(ccc12)-c1ccc(F)cc1
: