Target
Prothrombin
Ligand
BDBM13578
Substrate
BDBM13573
Meas. Tech.
Serine Protease Inhibition Assay
pH
7.8±n/a
Temperature
295.15±n/a K
Ki
48±n/a nM
Citation
 Groebke Zbinden, KBanner, DWAckermann, JD'Arcy, AKirchhofer, DJi, YHTschopp, TBWallbaum, SWeber, L Design of selective phenylglycine amide tissue factor/factor VIIa inhibitors. Bioorg Med Chem Lett 15:817-22 (2005)  
Target
Name:
Prothrombin
Synonyms:
Activation peptide fragment 1 Coagulation factor II Prothrombin precursor Thrombin heavy chain | Thrombin light chain
Type:
Protein
Mol. Mass.:
70029.57
Organism:
Homo sapiens (Human)
Description:
P00734
Residue:
622
  
Inhibitor
Name:
BDBM13578
Synonyms:
N-benzyl-2-[4-(benzyloxy)-3-ethoxyphenyl]-2-[(4-carbamimidoylphenyl)amino]acetamide | phenylglycine amide compound 4
Type:
Small organic molecule
Emp. Form.:
C31H32N4O3
Mol. Mass.:
508.6108
SMILES:
CCOc1cc(ccc1OCc1ccccc1)C(Nc1ccc(cc1)C(N)=N)C(=O)NCc1ccccc1
:
Substrate
Name:
BDBM13573
Synonyms:
(2S)-5-carbamimidamido-N-(4-nitrophenyl)-2-{[(2S)-1-{[(2S)-5-oxopyrrolidin-2-yl]carbonyl}pyrrolidin-2-yl]formamido}pentanamide hydrochloride Glu-Pro-Arg-pNA L-Pyroglutamyl-L-prolyl-L-arginine-p-Nitroaniline S-2366
Type:
Small organic molecule
Emp. Form.:
C22H30N8O6
Mol. Mass.:
502.5236
SMILES:
[#7]\[#6](-[#7])=[#7]/[#6]-[#6]-[#6]-[#6@H](-[#7]-[#6](=O)-[#6@@H]-1-[#6]-[#6]-[#6]-[#7]-1-[#6](=O)-[#6@@H]-1-[#6]-[#6]-[#6](=O)-[#7]-1)-[#6](=O)-[#7]-c1ccc(cc1)-[#7+](-[#8-])=O
: