Target
Coagulation factor VII
Ligand
BDBM13591
Substrate
BDBM13553
Meas. Tech.
Serine Protease Inhibition Assay
pH
7.8±n/a
Temperature
295.15±n/a K
Ki
35±n/a nM
Citation
 Groebke Zbinden, KBanner, DWHilpert, KHimber, JLave, TRiederer, MAStahl, MTschopp, TBObst-Sander, U Dose-dependent antithrombotic activity of an orally active tissue factor/factor VIIa inhibitor without concomitant enhancement of bleeding propensity. Bioorg Med Chem 14:5357-69 (2006)  
Target
Name:
Coagulation factor VII
Synonyms:
Eptacog alfa FA7_HUMAN Factor VIIa (fVIIa) SPCA serum prothrombin conversion accelerator
Type:
Enzyme
Mol. Mass.:
51599.89
Organism:
Homo sapiens (Human)
Description:
Residue:
466
  
Inhibitor
Name:
BDBM13591
Synonyms:
(2R)-2-[(4-carbamimidoylphenyl)amino]-2-{5-ethoxy-2-fluoro-3-[(3S)-oxolan-3-yloxy]phenyl}acetic acid phenylglycine derivative 6
Type:
Small organic molecule
Emp. Form.:
C21H24FN3O5
Mol. Mass.:
417.4308
SMILES:
CCOc1cc(O[C@H]2CCOC2)c(F)c(c1)[C@@H](Nc1ccc(cc1)C(N)=N)C(O)=O
:
Substrate
Name:
BDBM13553
Synonyms:
(2S)-5-carbamimidamido-2-{2-[(2R)-2-methanesulfonamido-3-phenylpropanamido]acetamido}-N-(4-nitrophenyl)pentanamide; acetic acid N-Methylsulfonyl-D-Phe-Gly-Arg-4-nitranilide acetate
Type:
Small organic molecule
Emp. Form.:
C24H32N8O7S
Mol. Mass.:
576.625
SMILES:
CS(=O)(=O)N[C@H](Cc1ccccc1)C(=O)NCC(=O)N[C@@H](CCCNC(N)=N)C(=O)Nc1ccc(cc1)[N+]([O-])=O
: