Target
Serine protease 1
Ligand
BDBM13589
Substrate
BDBM13574
Meas. Tech.
Serine Protease Inhibition Assay
Ki
3100±n/a nM
Citation
 Groebke Zbinden, KBanner, DWHilpert, KHimber, JLave, TRiederer, MAStahl, MTschopp, TBObst-Sander, U Dose-dependent antithrombotic activity of an orally active tissue factor/factor VIIa inhibitor without concomitant enhancement of bleeding propensity. Bioorg Med Chem 14:5357-69 (2006)  
Target
Name:
Serine protease 1
Synonyms:
Beta-Trypsin PRSS1 TRY1 TRYP1 Trypsin I
Type:
Enzyme
Mol. Mass.:
25790.52
Organism:
Bos taurus (bovine)
Description:
P00760
Residue:
246
  
Inhibitor
Name:
BDBM13589
Synonyms:
(4-carbamimidoyl-phenylamino)-[3-ethoxy-2-fluoro-5-(tetrahydro-furan-3- yloxy)-phenyl]-acetic acid phenylglycine derivative 4
Type:
Small organic molecule
Emp. Form.:
C21H24FN3O5
Mol. Mass.:
417.4308
SMILES:
CCOc1cc(OC2CCOC2)c(F)c(c1)C(Nc1ccc(cc1)C(N)=N)C(O)=O
:
Substrate
Name:
BDBM13574
Synonyms:
(2S)-6-amino-2-[(2S)-2-[(2R)-2-amino-3-methylbutanamido]-4-methylpentanamido]-N-(4-nitrophenyl)hexanamide dihydrochloride H-D-Valyl-L-leucyl-L-lysine-p-Nitroaniline dihydrochloride
Type:
Small organic molecule
Emp. Form.:
C23H38N6O5
Mol. Mass.:
478.585
SMILES:
CC(C)C[C@H](NC(=O)[C@H](N)C(C)C)C(=O)N[C@@H](CCCCN)C(=O)Nc1ccc(cc1)[N+]([O-])=O
: