Target
Prothrombin
Ligand
BDBM13778
Substrate
BDBM12679
Meas. Tech.
Enzyme Inhibition Assay
pH
7.4±n/a
Temperature
295.15±n/a K
Ki
2900±n/a nM
Citation
 Rai, RKolesnikov, ASprengeler, PATorkelson, STon, TKatz, BAYu, CHendrix, JShrader, WDStephens, RCabuslay, RSanford, EYoung, WB Discovery of novel heterocyclic factor VIIa inhibitors. Bioorg Med Chem Lett 16:2270-3 (2006)  
Target
Name:
Prothrombin
Synonyms:
Activation peptide fragment 1 Coagulation factor II Prothrombin precursor Thrombin heavy chain | Thrombin light chain
Type:
Protein
Mol. Mass.:
70029.57
Organism:
Homo sapiens (Human)
Description:
P00734
Residue:
622
  
Inhibitor
Name:
BDBM13778
Synonyms:
2-[3-(5-carbamimidoyl-1H-indol-2-yl)-4-hydroxy-5-(3-nitrophenyl)phenyl]acetic acid amidine-containing inhibitor 2
Type:
Small organic molecule
Emp. Form.:
C23H18N4O5
Mol. Mass.:
430.4128
SMILES:
NC(=N)c1ccc2[nH]c(cc2c1)-c1cc(CC(O)=O)cc(c1O)-c1cccc(c1)[N+]([O-])=O
:
Substrate
Name:
BDBM12679
Synonyms:
BDBM13790 Chromogenic Substrate
Type:
Small organic molecule
Emp. Form.:
C26H34N6O7S
Mol. Mass.:
574.649
SMILES:
Cc1ccc(cc1)S(=O)(=O)NCC(=O)N1CCCC1C(=O)NC(CCCCN)C(=O)Nc1ccc(cc1)[N+]([O-])=O
: