Target
Phosphatidylinositol 3-kinase catalytic subunit type 3
Ligand
BDBM338062
Substrate
Meas. Tech.
VPS34 Enzyme Assays
IC50
30±n/a nM
Citation
 Bharathan, ITBlackburn, CCiavarri, JPChouitar, JCullis, CAD Amore, NFleming, PEGigstad, KMGipson, KEGirard, MHu, YLee, JLi, GRezaei, MSintchak, MDSoucy, FStroud, SGVos, TJWong, TXu, HXu, TYe, Y Heteroaryls and uses thereof US Patent  US9751854 Publication Date 9/5/2017 
Target
Name:
Phosphatidylinositol 3-kinase catalytic subunit type 3
Synonyms:
BC033004 PIK3C3 Phosphatidylinositol 3-kinase catalytic subunit type 3 (PIK3C3) Phosphoinositide 3-Kinase (PI3K), Vps34 PtdIns-3-kinase type 3 hVPS34
Type:
Enzyme
Mol. Mass.:
101551.30
Organism:
Homo sapiens (Human)
Description:
Recombinant human Vps34 protein was expressed as monomeric GST-fusion and purified.
Residue:
887
  
Inhibitor
Name:
BDBM338062
Synonyms:
US9751854, Compound I-237 | US9802960, Compound I-237
Type:
Small organic molecule
Emp. Form.:
C22H15F5N6O2S
Mol. Mass.:
522.451
SMILES:
Cc1ncc(cc1NS(=O)(=O)c1ccc(F)cc1F)-c1ccnc(Nc2ccnc(n2)C(F)(F)F)c1
: