Target
Serine protease 1
Ligand
BDBM13945
Substrate
BDBM12679
Meas. Tech.
Enzyme Assay and Determination of the Inhibition Constants
pH
7.7±n/a
Temperature
295.15±n/a K
Ki
380±n/a nM
Citation
 Katz, BAElrod, KLuong, CRice, MJMackman, RLSprengeler, PASpencer, JHataye, JJanc, JLink, JLitvak, JRai, RRice, KSideris, SVerner, EYoung, W A novel serine protease inhibition motif involving a multi-centered short hydrogen bonding network at the active site. J Mol Biol 307:1451-86 (2001)  
Target
Name:
Serine protease 1
Synonyms:
Beta-Trypsin PRSS1 TRY1 TRYP1 Trypsin I
Type:
Enzyme
Mol. Mass.:
25790.52
Organism:
Bos taurus (bovine)
Description:
P00760
Residue:
246
  
Inhibitor
Name:
BDBM13945
Synonyms:
APC-13140 | [amino(2-{hydroxy[(3-phenoxyphenyl)methyl]carbamoyl}-1H-1,3-benzodiazol-5-yl)methylidene]azanium
Type:
Small organic molecule
Emp. Form.:
C22H20N5O3
Mol. Mass.:
402.4254
SMILES:
NC(=[NH2+])c1ccc2nc([nH]c2c1)C(=O)N(O)Cc1cccc(Oc2ccccc2)c1
:
Substrate
Name:
BDBM12679
Synonyms:
BDBM13790 Chromogenic Substrate
Type:
Small organic molecule
Emp. Form.:
C26H34N6O7S
Mol. Mass.:
574.649
SMILES:
Cc1ccc(cc1)S(=O)(=O)NCC(=O)N1CCCC1C(=O)NC(CCCCN)C(=O)Nc1ccc(cc1)[N+]([O-])=O
: