Target
Serine protease 1
Ligand
BDBM772
Substrate
BDBM12679
Meas. Tech.
Enzyme Assay and Determination of the Inhibition Constants
pH
7.4±n/a
Temperature
295.15±n/a K
Ki
4800±n/a nM
Citation
 Katz, BAElrod, KLuong, CRice, MJMackman, RLSprengeler, PASpencer, JHataye, JJanc, JLink, JLitvak, JRai, RRice, KSideris, SVerner, EYoung, W A novel serine protease inhibition motif involving a multi-centered short hydrogen bonding network at the active site. J Mol Biol 307:1451-86 (2001)  
Target
Name:
Serine protease 1
Synonyms:
Beta-Trypsin PRSS1 TRY1 TRYP1 Trypsin I
Type:
Enzyme
Mol. Mass.:
25790.52
Organism:
Bos taurus (bovine)
Description:
P00760
Residue:
246
  
Inhibitor
Name:
BDBM772
Synonyms:
Benzamidine [amino(phenyl)methylidene]azanium benzamidinium chloride
Type:
Emp. Form.:
C7H9N2
Mol. Mass.:
121.1592
SMILES:
NC(=[NH2+])c1ccccc1
:
Substrate
Name:
BDBM12679
Synonyms:
BDBM13790 Chromogenic Substrate
Type:
Small organic molecule
Emp. Form.:
C26H34N6O7S
Mol. Mass.:
574.649
SMILES:
Cc1ccc(cc1)S(=O)(=O)NCC(=O)N1CCCC1C(=O)NC(CCCCN)C(=O)Nc1ccc(cc1)[N+]([O-])=O
: