Target
Isocitrate dehydrogenase [NADP], mitochondrial [R140Q]
Ligand
BDBM339747
Substrate
Meas. Tech.
IDH2 Enzymatic Assay
IC50
550±n/a nM
Citation
 Popovici-Muller, JSalituro, FGSaunders, JOTravins, JYan, S Therapeutic compounds and compositions US Patent  US10202339 Publication Date 2/12/2019 
Target
Name:
Isocitrate dehydrogenase [NADP], mitochondrial [R140Q]
Synonyms:
IDH2 IDHP_HUMAN | idh2 r140q
Type:
Enzyme Catalytic Domain
Mol. Mass.:
50823.17
Organism:
Homo sapiens (Human)
Description:
P48735 (R140Q)
Residue:
452
  
Inhibitor
Name:
BDBM339747
Synonyms:
US10202339, Compound 192
Type:
Small organic molecule
Emp. Form.:
C26H20F3N3O4S
Mol. Mass.:
527.515
SMILES:
FC(F)(F)c1cccc(NC(=O)Nc2cc(ccc2Oc2ccccc2)S(=O)(=O)Nc2ccccc2)c1
: