Target
cAMP-dependent protein kinase catalytic subunit alpha [Q181K,T183A]
Ligand
BDBM14028
Substrate
Kemptide
Meas. Tech.
Kinase Activity Assay
IC50
109±n/a nM
Citation
 Bonn, SHerrero, SBreitenlechner, CBErlbruch, ALehmann, WEngh, RAGassel, MBossemeyer, D Structural analysis of protein kinase A mutants with Rho-kinase inhibitor specificity. J Biol Chem 281:24818-30 (2006)  
Target
Name:
cAMP-dependent protein kinase catalytic subunit alpha [Q181K,T183A]
Synonyms:
KAPCA_BOVIN PRKACA cAMP-Dependent Protein Kinase (PKA) Mutant PKAR2 (1) | cAMP-dependent protein kinase, alpha-catalytic subunit
Type:
Enzyme Catalytic Unit
Mol. Mass.:
40598.79
Organism:
Bos taurus (bovine)
Description:
P00517[Q181K,T183A]
Residue:
351
  
Inhibitor
Name:
BDBM14028
Synonyms:
(S)-2-METHYL-1-[(4-METHYL-5-ISOQUINOLINE)SULFONYL]-HOMOPIPERAZINE H-1152 | H-1152P
Type:
Small organic molecule
Emp. Form.:
C16H21N3O2S
Mol. Mass.:
319.422
SMILES:
C[C@H]1CNCCCN1S(=O)(=O)c1cccc2cncc(C)c12
:
Substrate
Name:
Kemptide
Synonyms:
Aurora Peptide Substrate
Type:
Peptide
Mol. Mass.:
773.92
Organism:
Description:
50 uM ATP as co-substrate.
Residue:
7
LRRASLG