Target
Fibroblast growth factor receptor 2
Ligand
BDBM339807
Substrate
Meas. Tech.
FGFR2 (Enzymatic Assay)
IC50
0.126±n/a nM
Citation
 Angibaud, PRObringer, MMarin, JJJeanty, M Naphthyridine derivative compounds US Patent  US9757364 Publication Date 9/12/2017 
Target
Name:
Fibroblast growth factor receptor 2
Synonyms:
BEK FGFR-2 FGFR2 Fibroblast growth factor receptor 2 (FGFR2) KGFR Keratinocyte growth factor receptor VEGF-receptor 2 and Fibroblast growth factor receptor 2
Type:
Enzyme
Mol. Mass.:
92015.45
Organism:
Homo sapiens (Human)
Description:
P21802
Residue:
821
  
Inhibitor
Name:
BDBM339807
Synonyms:
US9757364, Compound 11
Type:
Small organic molecule
Emp. Form.:
C23H24ClN5O3
Mol. Mass.:
453.921
SMILES:
COc1cc(OC)cc(c1)N(CCCO)c1ccc2ncc(-c3cnn(C)c3)c(Cl)c2n1
: