Target
Prothrombin
Ligand
BDBM14092
Substrate
BDBM14064
Meas. Tech.
Enzyme Inhibition Assay
Ki
0.99±n/a nM
Citation
 Costanzo, MJAlmond, HRHecker, LRSchott, MRYabut, SCZhang, HCAndrade-Gordon, PCorcoran, TWGiardino, ECKauffman, JALewis, JMde Garavilla, LHaertlein, BJMaryanoff, BE In-depth study of tripeptide-based alpha-ketoheterocycles as inhibitors of thrombin. Effective utilization of the S1' subsite and its implications to structure-based drug design. J Med Chem 48:1984-2008 (2005)  
Target
Name:
Prothrombin
Synonyms:
Activation peptide fragment 1 Coagulation factor II Prothrombin precursor Thrombin heavy chain | Thrombin light chain
Type:
Protein
Mol. Mass.:
70029.57
Organism:
Homo sapiens (Human)
Description:
P00734
Residue:
622
  
Inhibitor
Name:
BDBM14092
Synonyms:
(2S)-N-[(2S)-1-(1,3-benzothiazol-2-yl)-3-(3-carbamimidoylphenyl)-1-oxopropan-2-yl]-1-[(2R)-2-(methylamino)-3-phenylpropanoyl]pyrrolidine-2-carboxamide | 2-ketobenzothiazole 32
Type:
Small organic molecule
Emp. Form.:
C32H34N6O3S
Mol. Mass.:
582.716
SMILES:
CN[C@H](Cc1ccccc1)C(=O)N1CCC[C@H]1C(=O)N[C@@H](Cc1cccc(c1)C(N)=N)C(=O)c1nc2ccccc2s1
:
Substrate
Name:
BDBM14064
Synonyms:
(2S)-2-[(2S)-2-[(2R)-2-amino-3-(4-hydroxycyclohexyl)propanamido]propanamido]-5-carbamimidamido-N-(4-nitrophenyl)pentanamide; bis(acetic acid) Spectozyme TH
Type:
Small organic molecule
Emp. Form.:
C24H38N8O6
Mol. Mass.:
534.6085
SMILES:
CC(NC(=O)C(N)CC1CCC(O)CC1)C(=O)NC(CCC\[NH+]=C(\N)[NH-])C(=O)Nc1ccc(cc1)[N+]([O-])=O
: