Target
Urokinase-type plasminogen activator
Ligand
BDBM14143
Substrate
BDBM13949
Meas. Tech.
Enzyme Assay and Determination of the Inhibition Constants
Ki
300±n/a nM
Citation
 Katz, BASprengeler, PALuong, CVerner, EElrod, KKirtley, MJanc, JSpencer, JRBreitenbucher, JGHui, HMcGee, DAllen, DMartelli, AMackman, RL Engineering inhibitors highly selective for the S1 sites of Ser190 trypsin-like serine protease drug targets. Chem Biol 8:1107-21 (2001)  
Target
Name:
Urokinase-type plasminogen activator
Synonyms:
PLAU UROK_HUMAN Urokinase-type plasminogen activator (uPA) | Urokinase-type plasminogen activator/surface receptor
Type:
Enzyme
Mol. Mass.:
48528.62
Organism:
Homo sapiens (Human)
Description:
P00749
Residue:
431
  
Inhibitor
Name:
BDBM14143
Synonyms:
2-(2-HYDROXY-BIPHENYL)-1H-BENZOIMIDAZOLE-5-CARBOXAMIDINE APC-7806 | CHEMBL327715
Type:
Small organic molecule
Emp. Form.:
C20H16N4O
Mol. Mass.:
328.3672
SMILES:
NC(=N)c1ccc2nc([nH]c2c1)-c1cccc(-c2ccccc2)c1O
:
Substrate
Name:
BDBM13949
Synonyms:
(2S)-5-carbamimidamido-N-(4-nitrophenyl)-2-{2-[(2S)-2-(phenylformamido)propanamido]acetamido}pentanamide uPA Chromogenic Substrate
Type:
Small organic molecule
Emp. Form.:
C24H30N8O6
Mol. Mass.:
526.545
SMILES:
[#6]-[#6@H](-[#7]-[#6](=O)-c1ccccc1)-[#6](=O)-[#7]-[#6]-[#6](=O)-[#7]-[#6@@H](-[#6]-[#6]-[#6]\[#7]=[#6](\[#7])-[#7])-[#6](=O)-[#7]-c1ccc(cc1)-[#7+](-[#8-])=O
: