Target
Plasminogen
Ligand
BDBM14152
Substrate
BDBM12679
Meas. Tech.
Enzyme Assay and Determination of the Inhibition Constants
Ki
110±n/a nM
Citation
 Katz, BASprengeler, PALuong, CVerner, EElrod, KKirtley, MJanc, JSpencer, JRBreitenbucher, JGHui, HMcGee, DAllen, DMartelli, AMackman, RL Engineering inhibitors highly selective for the S1 sites of Ser190 trypsin-like serine protease drug targets. Chem Biol 8:1107-21 (2001)  
Target
Name:
Plasminogen
Synonyms:
Activation peptide PLG Plasmin Plasmin heavy chain A, short form | Plasmin light chain B
Type:
Enzyme
Mol. Mass.:
90579.18
Organism:
Homo sapiens (Human)
Description:
Residue:
810
  
Inhibitor
Name:
BDBM14152
Synonyms:
6-CHLORO-2-(2-HYDROXY-BIPHENYL-3-YL)-1H-INDOLE-5-CARBOXAMIDINE CA-14 {amino[6-chloro-2-(2-hydroxy-3-phenylphenyl)-1H-indol-5-yl]methylidene}azanium
Type:
Small organic molecule
Emp. Form.:
C21H17ClN3O
Mol. Mass.:
362.832
SMILES:
NC(=[NH2+])c1cc2cc([nH]c2cc1Cl)-c1cccc(-c2ccccc2)c1O
:
Substrate
Name:
BDBM12679
Synonyms:
BDBM13790 Chromogenic Substrate
Type:
Small organic molecule
Emp. Form.:
C26H34N6O7S
Mol. Mass.:
574.649
SMILES:
Cc1ccc(cc1)S(=O)(=O)NCC(=O)N1CCCC1C(=O)NC(CCCCN)C(=O)Nc1ccc(cc1)[N+]([O-])=O
: